testcode

qemu testing on Ubuntu 22.04 via the Phoronix Test Suite.

Compare your own system(s) to this result file with the Phoronix Test Suite by running the command: phoronix-test-suite benchmark 2209010-NE-TESTCODE650
Jump To Table - Results

Statistics

Remove Outliers Before Calculating Averages

Graph Settings

Prefer Vertical Bar Graphs

Multi-Way Comparison

Condense Multi-Option Tests Into Single Result Graphs

Table

Show Detailed System Result Table

Run Management

Result
Identifier
View Logs
Performance Per
Dollar
Date
Run
  Test
  Duration
Unknown - virtio_gpudrmfb - QEMU Virtual Machine
August 31
  5 Hours, 2 Minutes
Only show results matching title/arguments (delimit multiple options with a comma):


testcodeOpenBenchmarking.orgPhoronix Test Suite 10.8.4Unknown (8 Cores)QEMU Virtual Machine (0.0.0 BIOS)Red Hat QEMU PCIe1 x 8 GB RAM QEMU30GBvirtio_gpudrmfbQEMU GenericQEMU MonitorRed Hat Virtio deviceUbuntu 22.045.15.0-47-generic (aarch64)GCC 11.2.0ext41280x800qemuProcessorMotherboardChipsetMemoryDiskGraphicsAudioMonitorNetworkOSKernelCompilerFile-SystemScreen ResolutionSystem LayerTestcode BenchmarksSystem Logs- Transparent Huge Pages: madvise- --build=aarch64-linux-gnu --disable-libquadmath --disable-libquadmath-support --disable-werror --enable-bootstrap --enable-checking=release --enable-clocale=gnu --enable-default-pie --enable-fix-cortex-a53-843419 --enable-gnu-unique-object --enable-languages=c,ada,c++,go,d,fortran,objc,obj-c++,m2 --enable-libphobos-checking=release --enable-libstdcxx-debug --enable-libstdcxx-time=yes --enable-link-serialization=2 --enable-multiarch --enable-nls --enable-objc-gc=auto --enable-plugin --enable-shared --enable-threads=posix --host=aarch64-linux-gnu --program-prefix=aarch64-linux-gnu- --target=aarch64-linux-gnu --with-build-config=bootstrap-lto-lean --with-default-libstdcxx-abi=new --with-gcc-major-version-only --with-target-system-zlib=auto -v - Python 3.10.4- itlb_multihit: Not affected + l1tf: Not affected + mds: Not affected + meltdown: Not affected + mmio_stale_data: Not affected + retbleed: Not affected + spec_store_bypass: Vulnerable + spectre_v1: Mitigation of __user pointer sanitization + spectre_v2: Not affected + srbds: Not affected + tsx_async_abort: Not affected

testcodebuild-apache: Time To Compilebuild-ffmpeg: Time To Compilebuild-gcc: Time To Compilebuild-gdb: Time To Compilebuild-gem5: Time To Compilebuild-godot: Time To Compilebuild-imagemagick: Time To Compilebuild-linux-kernel: defconfigbuild-linux-kernel: allmodconfigbuild-llvm: Ninjabuild-llvm: Unix Makefilesbuild-mplayer: Time To Compilebuild-nodejs: Time To Compilebuild-php: Time To Compilebuild2: Time To Compilebuild-eigen: Time To Compilebuild-wasmer: Unknown - virtio_gpudrmfb - QEMU Virtual Machine19.84851.3041040.20778.583512.313125.72428.482267.5021351.299722.014741.85939.241686.25760.704135.24859.273OpenBenchmarking.org

Timed Apache Compilation

This test times how long it takes to build the Apache HTTPD web server. Learn more via the OpenBenchmarking.org test page.

OpenBenchmarking.orgSeconds, Fewer Is BetterTimed Apache Compilation 2.4.41Time To CompileUnknown - virtio_gpudrmfb - QEMU Virtual Machine510152025SE +/- 0.05, N = 319.85

Timed FFmpeg Compilation

This test times how long it takes to build the FFmpeg multimedia library. Learn more via the OpenBenchmarking.org test page.

OpenBenchmarking.orgSeconds, Fewer Is BetterTimed FFmpeg Compilation 4.4Time To CompileUnknown - virtio_gpudrmfb - QEMU Virtual Machine1224364860SE +/- 0.14, N = 351.30

Timed GCC Compilation

This test times how long it takes to build the GNU Compiler Collection (GCC) compiler. Learn more via the OpenBenchmarking.org test page.

OpenBenchmarking.orgSeconds, Fewer Is BetterTimed GCC Compilation 11.2.0Time To CompileUnknown - virtio_gpudrmfb - QEMU Virtual Machine2004006008001000SE +/- 3.42, N = 31040.21

Timed GDB GNU Debugger Compilation

This test times how long it takes to build the GNU Debugger (GDB) in a default configuration. Learn more via the OpenBenchmarking.org test page.

OpenBenchmarking.orgSeconds, Fewer Is BetterTimed GDB GNU Debugger Compilation 10.2Time To CompileUnknown - virtio_gpudrmfb - QEMU Virtual Machine20406080100SE +/- 0.39, N = 378.58

Timed Gem5 Compilation

This test times how long it takes to compile Gem5. Gem5 is a simulator for computer system architecture research. Gem5 is widely used for computer architecture research within the industry, academia, and more. Learn more via the OpenBenchmarking.org test page.

OpenBenchmarking.orgSeconds, Fewer Is BetterTimed Gem5 Compilation 21.2Time To CompileUnknown - virtio_gpudrmfb - QEMU Virtual Machine110220330440550SE +/- 0.14, N = 3512.31

Timed Godot Game Engine Compilation

This test times how long it takes to compile the Godot Game Engine. Godot is a popular, open-source, cross-platform 2D/3D game engine and is built using the SCons build system and targeting the X11 platform. Learn more via the OpenBenchmarking.org test page.

OpenBenchmarking.orgSeconds, Fewer Is BetterTimed Godot Game Engine Compilation 3.2.3Time To CompileUnknown - virtio_gpudrmfb - QEMU Virtual Machine306090120150SE +/- 0.46, N = 3125.72

Timed ImageMagick Compilation

This test times how long it takes to build ImageMagick. Learn more via the OpenBenchmarking.org test page.

OpenBenchmarking.orgSeconds, Fewer Is BetterTimed ImageMagick Compilation 6.9.0Time To CompileUnknown - virtio_gpudrmfb - QEMU Virtual Machine714212835SE +/- 0.12, N = 328.48

Timed Linux Kernel Compilation

This test times how long it takes to build the Linux kernel in a default configuration (defconfig) for the architecture being tested or alternatively an allmodconfig for building all possible kernel modules for the build. Learn more via the OpenBenchmarking.org test page.

OpenBenchmarking.orgSeconds, Fewer Is BetterTimed Linux Kernel Compilation 5.18Build: defconfigUnknown - virtio_gpudrmfb - QEMU Virtual Machine60120180240300SE +/- 0.49, N = 3267.50

OpenBenchmarking.orgSeconds, Fewer Is BetterTimed Linux Kernel Compilation 5.18Build: allmodconfigUnknown - virtio_gpudrmfb - QEMU Virtual Machine30060090012001500SE +/- 0.22, N = 31351.30

Timed LLVM Compilation

This test times how long it takes to build the LLVM compiler stack. Learn more via the OpenBenchmarking.org test page.

OpenBenchmarking.orgSeconds, Fewer Is BetterTimed LLVM Compilation 13.0Build System: NinjaUnknown - virtio_gpudrmfb - QEMU Virtual Machine160320480640800SE +/- 0.40, N = 3722.01

OpenBenchmarking.orgSeconds, Fewer Is BetterTimed LLVM Compilation 13.0Build System: Unix MakefilesUnknown - virtio_gpudrmfb - QEMU Virtual Machine160320480640800SE +/- 1.77, N = 3741.86

Timed Mesa Compilation

This test profile times how long it takes to compile Mesa with Meson/Ninja. For minimizing build dependencies and avoid versioning conflicts, test this is just the core Mesa build without LLVM or the extra Gallium3D/Mesa drivers enabled. Learn more via the OpenBenchmarking.org test page.

Unknown - virtio_gpudrmfb - QEMU Virtual Machine: The test quit with a non-zero exit status. The test quit with a non-zero exit status. The test quit with a non-zero exit status. E: ninja: error: loading 'build.ninja': No such file or directory

Timed MPlayer Compilation

This test times how long it takes to build the MPlayer open-source media player program. Learn more via the OpenBenchmarking.org test page.

OpenBenchmarking.orgSeconds, Fewer Is BetterTimed MPlayer Compilation 1.5Time To CompileUnknown - virtio_gpudrmfb - QEMU Virtual Machine918273645SE +/- 0.05, N = 339.24

Timed Node.js Compilation

This test profile times how long it takes to build/compile Node.js itself from source. Node.js is a JavaScript run-time built from the Chrome V8 JavaScript engine while itself is written in C/C++. Learn more via the OpenBenchmarking.org test page.

OpenBenchmarking.orgSeconds, Fewer Is BetterTimed Node.js Compilation 17.3Time To CompileUnknown - virtio_gpudrmfb - QEMU Virtual Machine150300450600750SE +/- 1.38, N = 3686.26

Timed PHP Compilation

This test times how long it takes to build PHP 7. Learn more via the OpenBenchmarking.org test page.

OpenBenchmarking.orgSeconds, Fewer Is BetterTimed PHP Compilation 7.4.2Time To CompileUnknown - virtio_gpudrmfb - QEMU Virtual Machine1428425670SE +/- 0.34, N = 360.70

Build2

This test profile measures the time to bootstrap/install the build2 C++ build toolchain from source. Build2 is a cross-platform build toolchain for C/C++ code and features Cargo-like features. Learn more via the OpenBenchmarking.org test page.

OpenBenchmarking.orgSeconds, Fewer Is BetterBuild2 0.13Time To CompileUnknown - virtio_gpudrmfb - QEMU Virtual Machine306090120150SE +/- 0.69, N = 3135.25

Timed Eigen Compilation

This test times how long it takes to build all Eigen examples. The Eigen examples are compiled serially. Eigen is a C++ template library for linear algebra. Learn more via the OpenBenchmarking.org test page.

OpenBenchmarking.orgSeconds, Fewer Is BetterTimed Eigen Compilation 3.3.9Time To CompileUnknown - virtio_gpudrmfb - QEMU Virtual Machine1326395265SE +/- 0.11, N = 359.27

Timed Erlang/OTP Compilation

This test times how long it takes to compile Erlang/OTP. Erlang is a programming language and run-time for massively scalable soft real-time systems with high availability requirements. Learn more via the OpenBenchmarking.org test page.

Unknown - virtio_gpudrmfb - QEMU Virtual Machine: The test quit with a non-zero exit status. The test quit with a non-zero exit status. The test quit with a non-zero exit status. E: pkey.c:76:14: error: implicit declaration of function ‘FIPS_mode’ [-Werror=implicit-function-declaration]

Timed Wasmer Compilation

This test times how long it takes to compile Wasmer. Wasmer is written in the Rust programming language and is a WebAssembly runtime implementation that supports WASI and EmScripten. This test profile builds Wasmer with the Cranelift and Singlepast compiler features enabled. Learn more via the OpenBenchmarking.org test page.

Unknown - virtio_gpudrmfb - QEMU Virtual Machine: The test quit with a non-zero exit status. The test quit with a non-zero exit status. The test quit with a non-zero exit status. E: error: build failed